Home > Clang Error > Clang Error No Such File Or Directory Clang Error No Input Files

Clang Error No Such File Or Directory Clang Error No Input Files

Contents

This way, when you compile the main project, the static library subproject gets compiled before the main project and your static library will be available. You have to find that static library project e.g.. "filename.a" under 'Link Binary With Libraries' in Build Phase and then remove it and add it again. Then I found out, that the path to the group, where I wanted to add my file, was path to nowhere. Not the answer you're looking for? http://buzzmeup.net/clang-error/clang-error-no-input-files-gcc.html

i hope its worked. share|improve this answer edited Jul 5 '12 at 21:54 answered Jul 5 '12 at 21:26 vikingosegundo 44k1197146 I think this happens when you try to pull merge from git This may work for you. You can not post a blank message. i thought about this

Clang Error No Such File Or Directory Clang Error No Input Files

Xcode seems to think they're in a directory parallel to SampleApp. However due to my running this in Jenkins for autobuild purposes it still doesn't work as I'd like - getting stuck in exactly the same place. Jan 26, 2015 8:21 PM Helpful (0) Reply options Link to this post Apple Footer This site contains user submitted content, comments and opinions and is for informational purposes only. Personal Open source Business Explore Sign up Sign in Pricing Blog Support Search GitHub This repository Watch 127 Star 4,334 Fork 195 decosoftware/deco-ide Code Issues 63 Pull requests 2 Projects

chrise86 commented Aug 12, 2016 @superandrew213 I restarted Xcode multiple, multiple times - it's THE go-to solution with Xcode 😉, but in this case it didn't work. more stack exchange communities company blog Stack Exchange Inbox Reputation and Badges sign up log in tour help Tour Start here for a quick overview of the site Help Center Detailed See screenshot below for a visual cue. Clang Error No Such File Or Directory 'uikit' Authoritative source that <> and != are identical in performance in SQL Server Why are Car Batteries Still So Heavy?

Everything else was excellent advice. Right-click on that item and select "delete". Could the atmosphere be compressed and put into bottles? http://stackoverflow.com/questions/37289993/clang-error-no-such-file-or-directory-when-trying-to-run-app Random integers with differing probabilities Difference between particle and adverb in English Word to describe object that can be physically passed through Animate finding the middle If the co-signer on my

Open Menu Close Menu Apple Shopping Bag Apple Mac iPad iPhone Watch TV Music Support Search apple.com Shopping Bag : CommunitiesSign inPostBrowse discussionsContact SupportSearchCommunitiesContact SupportSign inContentPeopleSearch Support CommunitiesDeveloper Forums Please enter Clang Error No Such File Or Directory Deriveddata MacBook Pro, OS X Yosemite (10.10.1), null Posted on Jan 24, 2015 5:33 PM Reply I have this question too Q: Clang: Error: No Such File or Directory Hide Question All Edit the RNTest scheme(press CMD+SHIFT+< or Product->Scheme->Edit Scheme), change Build Configuration to Release 3. How do I figure out the problem (and fix it!)?

Clang Error No Such File Or Directory Terminal

Why do Internet forums tend to prohibit responding to inactive threads? PPCG Jeopardy: Robbers PPCG Jeopardy: Cops Did people in China resort to cannibalism during the reign of Mao? Clang Error No Such File Or Directory Clang Error No Input Files Why don't my users have separate desktops in Windows 10? Clang Error No Such File Or Directory Xcode My boss asks me to stop writing small functions and do everything in the same loop Multiple TXT fields for same subdomain Is it possible to use blockchain or public ledgers

Did clean and run; quit Xcode couple of times but did not work. –rohan-patel Aug 16 '15 at 17:59 I had a similar problem with Pods, for a unknown http://buzzmeup.net/clang-error/clang-error-no-such-file-or-directory-libgcc-a.html Which Puranic Scriptures describes procedure of "Ashtanga Yoga"? How might a government pass a law without the population knowing? Not the answer you're looking for? Clang Error No Such File Or Directory C++

Huffman compressor in Java Difference between particle and adverb in English Is there a command for running a script according to its shebang line? When i m trying to run app or archiving build on that time i faced this error. A local puzzler lawyering around with a finish door Why does the '!!' shortcut fail to execute the previously run command? this contact form But with another pod install everything works again.

Thanks in Advance.. :) ios clang share|improve this question edited May 18 at 4:21 asked May 18 at 3:53 P.G.Progs 769629 Please include the relevant section of code. –philo Clang Error No Such File Or Directory 'armv7' Fired because your skills are too far above your coworkers Refreshing flash memories. Can my employer see what I do on the internet when I am connected to the company network?

Find the "Recursive Size" of a List Why does the '!!' shortcut fail to execute the previously run command?

more stack exchange communities company blog Stack Exchange Inbox Reputation and Badges sign up log in tour help Tour Start here for a quick overview of the site Help Center Detailed We recommend upgrading to the latest Safari, Google Chrome, or Firefox. What period of time must pass until a removed person can re-enter the UK? Clang Error No Such File Or Directory Mac Join them; it only takes a minute: Sign up xcodebuild failure clang:error no such file or directory: up vote 8 down vote favorite Having a problem when building with xcodebuild.

After this change all work well. asked 3 years ago viewed 12363 times active 24 days ago Upcoming Events 2016 Community Moderator Election ends in 3 days Linked 2 clang: error: no such file or directory: '/Project/SDWebImage-3.7.1/build/Release-iphonesimulator/libSDWebImage.a' And remember: make a copy of your whole project first — for every try. navigate here In it, you'll get: The week's top questions and answers Important community announcements Questions that need answers see an example newsletter By subscribing, you agree to the privacy policy and terms

Apple hasn't used the real "gcc" for years. (Read up on the GPLv3 for more information.)The gcc/clang arguments are the same. Why are the memory addresses of string literals so different from others', on Linux? We recommend upgrading to the latest Safari, Google Chrome, or Firefox. This fixed the issue for me :) share|improve this answer answered Sep 28 '15 at 21:03 TocToc 7661922 This solved my problem.

Linked 1 clang: error: no such file or directory: ASIAuthenticationDialog.m Related 24RestKit/RestKit.h file not found error - version 0.10.00Clang error: Duplicate Symbol0when i build my project in xcode i got an share|improve this answer edited Dec 14 '15 at 1:14 Arthur Korchagin 2,492102652 answered Dec 13 '15 at 16:37 Rakan Bushnaq 1 add a comment| Your Answer draft saved draft discarded Then go to Build phases. I really wanted a rhombus, but all I got was this stupid rectangle Is there oscillating charge in a hydrogen atom?

I removed the library and the build succeeded. And after I check more cases(Build Configuration and target devices), only simulator with Release build configuration will cause this problem. Why do Internet forums tend to prohibit responding to inactive threads? Join them; it only takes a minute: Sign up clang: error: no such file or directory when trying to run app up vote 3 down vote favorite 1 I have added

Based on your location, we recommend that you select: . xcworkspace, and select the target device to a simulator(say iPhone 6) 2. share|improve this answer answered Nov 4 '14 at 1:34 Pan 111 Can you expand this to explain how and why this will help? –Hosch250 Nov 4 '14 at 1:53 Asked by Darshan Ranjit Darshan Ranjit (view profile) 1 question 0 answers 0 accepted answers Reputation: 0 on 10 Aug 2016 13 views (last 30 days) 13 views (last 30 days)

It is still in the folder of your project — if you added it successfully in the first place — you just got rid of all project references. Jan 25, 2015 7:25 AM Helpful (0) Reply options Link to this post by Lvk3, Lvk3 Jan 26, 2015 8:21 PM in response to etresoft Level 1 (0 points) Jan 26,